Information card for entry 4342433
Formula | C29 H33 O0.5 P Te |
Calculated formula | C29 H33 O0.5 P Te |
Title of publication | Peri-Substituted Phosphorus-Tellurium Systems-An Experimental and Theoretical Investigation of the P···Te through-Space Interaction. |
Authors of publication | Nordheider, Andreas; Hupf, Emanuel; Chalmers, Brian A.; Knight, Fergus R.; Bühl, Michael; Mebs, Stefan; Chęcińska, Lilianna; Lork, Enno; Camacho, Paula Sanz; Ashbrook, Sharon E.; Athukorala Arachchige, Kasun S.; Cordes, David B.; Slawin, Alexandra M. Z.; Beckmann, Jens; Woollins, J. Derek |
Journal of publication | Inorganic chemistry |
Year of publication | 2015 |
Journal volume | 54 |
Journal issue | 5 |
Pages of publication | 2435 |
a | 9.03 ± 0.003 Å |
b | 12.06 ± 0.004 Å |
c | 13.39 ± 0.004 Å |
α | 105 ± 0.009° |
β | 97 ± 0.01° |
γ | 92 ± 0.011° |
Cell volume | 1394.6 ± 0.8 Å3 |
Cell temperature | 125 K |
Ambient diffraction temperature | 125 K |
Number of distinct elements | 5 |
Space group number | 2 |
Hermann-Mauguin space group symbol | P -1 |
Hall space group symbol | -P 1 |
Residual factor for significantly intense reflections | 0.036 |
Weighted residual factors for all reflections included in the refinement | 0.1079 |
Goodness-of-fit parameter for all reflections included in the refinement | 1.154 |
Diffraction radiation wavelength | 0.71075 Å |
Diffraction radiation type | MoKα |