Information card for entry 4342468
Formula | Ba3.2 K0.8 S6 U |
Calculated formula | Ba3.1984 K0.8016 S6 U |
Title of publication | Positional Flexibility: Syntheses and Characterization of Six Uranium Chalcogenides Related to the 2H Hexagonal Perovskite Family. |
Authors of publication | Mesbah, Adel; Prakash, Jai; Beard, Jessica C.; Pozzi, Eric A.; Tarasenko, Mariya S.; Lebègue, Sébastien; Malliakas, Christos D.; Van Duyne, Richard P.; Ibers, James A. |
Journal of publication | Inorganic chemistry |
Year of publication | 2015 |
Journal volume | 54 |
Journal issue | 6 |
Pages of publication | 2851 - 2857 |
a | 12.0798 ± 0.0002 Å |
b | 12.0798 ± 0.0002 Å |
c | 15.0309 ± 0.0003 Å |
α | 90° |
β | 90° |
γ | 120° |
Cell volume | 1899.48 ± 0.06 Å3 |
Cell temperature | 100 ± 2 K |
Ambient diffraction temperature | 100 ± 2 K |
Number of distinct elements | 4 |
Space group number | 167 |
Hermann-Mauguin space group symbol | R -3 c :H |
Hall space group symbol | -R 3 2"c |
Residual factor for all reflections | 0.0124 |
Residual factor for significantly intense reflections | 0.0111 |
Weighted residual factors for significantly intense reflections | 0.0187 |
Weighted residual factors for all reflections included in the refinement | 0.0188 |
Goodness-of-fit parameter for all reflections included in the refinement | 1.448 |
Diffraction radiation wavelength | 0.71073 Å |
Diffraction radiation type | MoKα |