Information card for entry 4342469
Formula | Ba3.3 Rb0.7 S6 U |
Calculated formula | Ba3.293 Rb0.707 S6 U |
Title of publication | Positional Flexibility: Syntheses and Characterization of Six Uranium Chalcogenides Related to the 2H Hexagonal Perovskite Family. |
Authors of publication | Mesbah, Adel; Prakash, Jai; Beard, Jessica C.; Pozzi, Eric A.; Tarasenko, Mariya S.; Lebègue, Sébastien; Malliakas, Christos D.; Van Duyne, Richard P.; Ibers, James A. |
Journal of publication | Inorganic chemistry |
Year of publication | 2015 |
Journal volume | 54 |
Journal issue | 6 |
Pages of publication | 2851 - 2857 |
a | 12.0875 ± 0.0003 Å |
b | 12.0875 ± 0.0003 Å |
c | 15.1516 ± 0.0005 Å |
α | 90° |
β | 90° |
γ | 120° |
Cell volume | 1917.18 ± 0.09 Å3 |
Cell temperature | 100 ± 2 K |
Ambient diffraction temperature | 100 ± 2 K |
Number of distinct elements | 4 |
Space group number | 167 |
Hermann-Mauguin space group symbol | R -3 c :H |
Hall space group symbol | -R 3 2"c |
Residual factor for all reflections | 0.0104 |
Residual factor for significantly intense reflections | 0.0094 |
Weighted residual factors for significantly intense reflections | 0.0193 |
Weighted residual factors for all reflections included in the refinement | 0.0194 |
Goodness-of-fit parameter for all reflections included in the refinement | 1.378 |
Diffraction radiation wavelength | 0.71073 Å |
Diffraction radiation type | MoKα |