Information card for entry 4342473
Common name | Cr(CO)5(pMeCNArMes2) |
Formula | C31 H27 Cr N O5 |
Calculated formula | C31 H27 Cr N O5 |
SMILES | [Cr](C#[O])(C#[O])(C#[O])(C#[O])(C#[O])C#[N]c1c(cc(C)cc1c1c(C)cc(C)cc1C)c1c(C)cc(C)cc1C |
Title of publication | Comparative measure of the electronic influence of highly substituted aryl isocyanides. |
Authors of publication | Carpenter, Alex E.; Mokhtarzadeh, Charles C.; Ripatti, Donald S.; Havrylyuk, Irena; Kamezawa, Ryo; Moore, Curtis E.; Rheingold, Arnold L.; Figueroa, Joshua S. |
Journal of publication | Inorganic chemistry |
Year of publication | 2015 |
Journal volume | 54 |
Journal issue | 6 |
Pages of publication | 2936 - 2944 |
a | 11.4647 ± 0.0007 Å |
b | 19.4477 ± 0.0011 Å |
c | 12.6957 ± 0.0008 Å |
α | 90° |
β | 95.256 ± 0.001° |
γ | 90° |
Cell volume | 2818.8 ± 0.3 Å3 |
Cell temperature | 100 K |
Ambient diffraction temperature | 100 K |
Number of distinct elements | 5 |
Space group number | 14 |
Hermann-Mauguin space group symbol | P 1 21/c 1 |
Hall space group symbol | -P 2ybc |
Residual factor for all reflections | 0.0351 |
Residual factor for significantly intense reflections | 0.0322 |
Weighted residual factors for significantly intense reflections | 0.0882 |
Weighted residual factors for all reflections included in the refinement | 0.0912 |
Goodness-of-fit parameter for all reflections included in the refinement | 1.033 |
Diffraction radiation probe | x-ray |
Diffraction radiation wavelength | 0.71073 Å |
Diffraction radiation type | MoKα |