Information card for entry 4342474
Common name | CNArTripp2 |
Formula | C37 H49 N |
Calculated formula | C37 H49 N |
SMILES | C#[N]c1c(cccc1c1c(C(C)C)cc(C(C)C)cc1C(C)C)c1c(C(C)C)cc(C(C)C)cc1C(C)C |
Title of publication | Comparative measure of the electronic influence of highly substituted aryl isocyanides. |
Authors of publication | Carpenter, Alex E.; Mokhtarzadeh, Charles C.; Ripatti, Donald S.; Havrylyuk, Irena; Kamezawa, Ryo; Moore, Curtis E.; Rheingold, Arnold L.; Figueroa, Joshua S. |
Journal of publication | Inorganic chemistry |
Year of publication | 2015 |
Journal volume | 54 |
Journal issue | 6 |
Pages of publication | 2936 - 2944 |
a | 10.9087 ± 0.0013 Å |
b | 12.0442 ± 0.0014 Å |
c | 25.283 ± 0.003 Å |
α | 90° |
β | 90° |
γ | 90° |
Cell volume | 3321.8 ± 0.7 Å3 |
Cell temperature | 100 K |
Ambient diffraction temperature | 100 K |
Number of distinct elements | 3 |
Space group number | 57 |
Hermann-Mauguin space group symbol | P b c m |
Hall space group symbol | -P 2c 2b |
Residual factor for all reflections | 0.0633 |
Residual factor for significantly intense reflections | 0.0454 |
Weighted residual factors for significantly intense reflections | 0.1143 |
Weighted residual factors for all reflections included in the refinement | 0.1264 |
Goodness-of-fit parameter for all reflections included in the refinement | 1.043 |
Diffraction radiation probe | x-ray |
Diffraction radiation wavelength | 0.71073 Å |
Diffraction radiation type | MoKα |