Information card for entry 4342494
Formula | C33 H36 Mn2 N4 O13 Rb2 |
Calculated formula | C33 H36 Mn2 N4 O13 Rb2 |
Title of publication | Alkali-Metal-Ion-Directed Self-Assembly of Redox-Active Manganese(III) Supramolecular Boxes. |
Authors of publication | González-Riopedre, Gustavo; Bermejo, Manuel R.; Fernández-García, M Isabel; González-Noya, Ana M; Pedrido, Rosa; Rodríguez-Doutón, M Jesús; Maneiro, Marcelino |
Journal of publication | Inorganic chemistry |
Year of publication | 2015 |
Journal volume | 54 |
Journal issue | 6 |
Pages of publication | 2512 - 2521 |
a | 9.6398 ± 0.0015 Å |
b | 17.688 ± 0.003 Å |
c | 10.5316 ± 0.0017 Å |
α | 90° |
β | 102.232 ± 0.003° |
γ | 90° |
Cell volume | 1755 ± 0.5 Å3 |
Cell temperature | 120 ± 2 K |
Ambient diffraction temperature | 120 ± 2 K |
Number of distinct elements | 6 |
Space group number | 4 |
Hermann-Mauguin space group symbol | P 1 21 1 |
Hall space group symbol | P 2yb |
Residual factor for all reflections | 0.0443 |
Residual factor for significantly intense reflections | 0.0329 |
Weighted residual factors for significantly intense reflections | 0.0695 |
Weighted residual factors for all reflections included in the refinement | 0.075 |
Goodness-of-fit parameter for all reflections included in the refinement | 1.095 |
Diffraction radiation probe | x-ray |
Diffraction radiation wavelength | 0.71073 Å |
Diffraction radiation type | MoKα |