Information card for entry 4342495
Formula | C16 H14 Cs Mn N2 O5 |
Calculated formula | C16 H14 Cs Mn N2 O5 |
Title of publication | Alkali-Metal-Ion-Directed Self-Assembly of Redox-Active Manganese(III) Supramolecular Boxes. |
Authors of publication | González-Riopedre, Gustavo; Bermejo, Manuel R.; Fernández-García, M Isabel; González-Noya, Ana M; Pedrido, Rosa; Rodríguez-Doutón, M Jesús; Maneiro, Marcelino |
Journal of publication | Inorganic chemistry |
Year of publication | 2015 |
Journal volume | 54 |
Journal issue | 6 |
Pages of publication | 2512 - 2521 |
a | 10.839 ± 0.002 Å |
b | 15.437 ± 0.003 Å |
c | 9.3724 ± 0.0019 Å |
α | 90° |
β | 92.052 ± 0.004° |
γ | 90° |
Cell volume | 1567.2 ± 0.5 Å3 |
Cell temperature | 120 ± 2 K |
Ambient diffraction temperature | 120 ± 2 K |
Number of distinct elements | 6 |
Space group number | 14 |
Hermann-Mauguin space group symbol | P 1 21/c 1 |
Hall space group symbol | -P 2ybc |
Residual factor for all reflections | 0.0618 |
Residual factor for significantly intense reflections | 0.0374 |
Weighted residual factors for significantly intense reflections | 0.0699 |
Weighted residual factors for all reflections included in the refinement | 0.0749 |
Goodness-of-fit parameter for all reflections included in the refinement | 1.098 |
Diffraction radiation probe | x-ray |
Diffraction radiation wavelength | 0.7107 Å |
Diffraction radiation type | MoKα |