Information card for entry 4342509
Formula | C123.55 H174.6 N11 Na Ni2 O20.5 |
Calculated formula | C123.55 H174.6 N11 Na Ni2 O20.5 |
Title of publication | A family of tri- and dimetallic pyridine dicarboxamide cryptates: unusual o,n,o-coordination and facile access to secondary coordination sphere hydrogen bonding interactions. |
Authors of publication | Guillet, Gary L.; Gordon, Jesse B.; Di Francesco, Gianna N.; Calkins, Matthew W.; Čižmár, Erik; Abboud, Khalil A.; Meisel, Mark W.; García-Serres, Ricardo; Murray, Leslie J. |
Journal of publication | Inorganic chemistry |
Year of publication | 2015 |
Journal volume | 54 |
Journal issue | 6 |
Pages of publication | 2691 - 2704 |
a | 17.174 ± 0.0009 Å |
b | 25.4074 ± 0.0014 Å |
c | 29.3905 ± 0.0016 Å |
α | 90° |
β | 96.148 ± 0.001° |
γ | 90° |
Cell volume | 12750.7 ± 1.2 Å3 |
Cell temperature | 100 ± 2 K |
Ambient diffraction temperature | 100 ± 2 K |
Number of distinct elements | 6 |
Space group number | 14 |
Hermann-Mauguin space group symbol | P 1 21/c 1 |
Hall space group symbol | -P 2ybc |
Residual factor for all reflections | 0.1339 |
Residual factor for significantly intense reflections | 0.0821 |
Weighted residual factors for significantly intense reflections | 0.2319 |
Weighted residual factors for all reflections included in the refinement | 0.2504 |
Goodness-of-fit parameter for all reflections included in the refinement | 1.457 |
Diffraction radiation wavelength | 0.71073 Å |
Diffraction radiation type | MoKα |