Information card for entry 4342510
Formula | C121 H163 Cl K N9 Ni3 O23 |
Calculated formula | C113 H143 Cl K N9 Ni3 O21 |
Title of publication | A family of tri- and dimetallic pyridine dicarboxamide cryptates: unusual o,n,o-coordination and facile access to secondary coordination sphere hydrogen bonding interactions. |
Authors of publication | Guillet, Gary L.; Gordon, Jesse B.; Di Francesco, Gianna N.; Calkins, Matthew W.; Čižmár, Erik; Abboud, Khalil A.; Meisel, Mark W.; García-Serres, Ricardo; Murray, Leslie J. |
Journal of publication | Inorganic chemistry |
Year of publication | 2015 |
Journal volume | 54 |
Journal issue | 6 |
Pages of publication | 2691 - 2704 |
a | 58.49 ± 0.004 Å |
b | 58.49 ± 0.004 Å |
c | 18.9701 ± 0.0012 Å |
α | 90° |
β | 90° |
γ | 120° |
Cell volume | 56204 ± 6 Å3 |
Cell temperature | 100 ± 2 K |
Ambient diffraction temperature | 100 ± 2 K |
Number of distinct elements | 7 |
Space group number | 148 |
Hermann-Mauguin space group symbol | R -3 :H |
Hall space group symbol | -R 3 |
Residual factor for all reflections | 0.0806 |
Residual factor for significantly intense reflections | 0.061 |
Weighted residual factors for significantly intense reflections | 0.1415 |
Weighted residual factors for all reflections included in the refinement | 0.1507 |
Goodness-of-fit parameter for all reflections included in the refinement | 1.038 |
Diffraction radiation wavelength | 0.71073 Å |
Diffraction radiation type | MoKα |