Information card for entry 4342512
Common name | Lithium cobalt tin sulfide |
Formula | Co Li2 S4 Sn |
Calculated formula | Co Li2 S4 Sn |
Title of publication | Outstanding Laser Damage Threshold in Li2MnGeS4 and Tunable Optical Nonlinearity in Diamond-Like Semiconductors. |
Authors of publication | Brant, Jacilynn A.; Clark, Daniel J.; Kim, Yong Soo; Jang, Joon I.; Weiland, Ashley; Aitken, Jennifer A. |
Journal of publication | Inorganic chemistry |
Year of publication | 2015 |
Journal volume | 54 |
Journal issue | 6 |
Pages of publication | 2809 - 2819 |
a | 6.3432 ± 0.0002 Å |
b | 6.7184 ± 0.0002 Å |
c | 7.9404 ± 0.0003 Å |
α | 90° |
β | 89.988 ± 0.002° |
γ | 90° |
Cell volume | 338.389 ± 0.019 Å3 |
Cell temperature | 296 ± 2 K |
Ambient diffraction temperature | 296 ± 2 K |
Number of distinct elements | 4 |
Space group number | 7 |
Hermann-Mauguin space group symbol | P 1 n 1 |
Hall space group symbol | P -2yac |
Residual factor for all reflections | 0.0315 |
Residual factor for significantly intense reflections | 0.025 |
Weighted residual factors for significantly intense reflections | 0.0477 |
Weighted residual factors for all reflections included in the refinement | 0.0494 |
Goodness-of-fit parameter for all reflections included in the refinement | 1.032 |
Diffraction radiation wavelength | 0.71073 Å |
Diffraction radiation type | MoKα |