Information card for entry 4342511
Common name | Lithium Manganese Germanium Sulfide |
Formula | Ge Li2 Mn S4 |
Calculated formula | Ge Li2 Mn S4 |
Title of publication | Outstanding Laser Damage Threshold in Li2MnGeS4 and Tunable Optical Nonlinearity in Diamond-Like Semiconductors. |
Authors of publication | Brant, Jacilynn A.; Clark, Daniel J.; Kim, Yong Soo; Jang, Joon I.; Weiland, Ashley; Aitken, Jennifer A. |
Journal of publication | Inorganic chemistry |
Year of publication | 2015 |
Journal volume | 54 |
Journal issue | 6 |
Pages of publication | 2809 - 2819 |
a | 13.3546 ± 0.0002 Å |
b | 7.8871 ± 0.0001 Å |
c | 6.2806 ± 0.0001 Å |
α | 90° |
β | 90° |
γ | 90° |
Cell volume | 661.53 ± 0.017 Å3 |
Cell temperature | 296 ± 2 K |
Ambient diffraction temperature | 296 ± 2 K |
Number of distinct elements | 4 |
Space group number | 33 |
Hermann-Mauguin space group symbol | P n a 21 |
Hall space group symbol | P 2c -2n |
Residual factor for all reflections | 0.0109 |
Residual factor for significantly intense reflections | 0.0097 |
Weighted residual factors for significantly intense reflections | 0.0252 |
Weighted residual factors for all reflections included in the refinement | 0.0273 |
Goodness-of-fit parameter for all reflections included in the refinement | 0.826 |
Diffraction radiation wavelength | 0.71073 Å |
Diffraction radiation type | MoKα |