Information card for entry 4342542
Formula | C35.5 H42 N O P2 Rh |
Calculated formula | C35.5 H42 N O P2 Rh |
Title of publication | Comparison of the Electronic Properties of Diarylamido-Based PNZ Pincer Ligands: Redox Activity at the Ligand and Donor Ability Toward the Metal. |
Authors of publication | Davidson, Jillian J.; DeMott, Jessica C.; Douvris, Christos; Fafard, Claudia M.; Bhuvanesh, Nattamai; Chen, Chun-Hsing; Herbert, David E.; Lee, Chun-I; McCulloch, Billy J.; Foxman, Bruce M.; Ozerov, Oleg V. |
Journal of publication | Inorganic chemistry |
Year of publication | 2015 |
Journal volume | 54 |
Journal issue | 6 |
Pages of publication | 2916 - 2935 |
a | 24.099 ± 0.002 Å |
b | 9.336 ± 0.0008 Å |
c | 15.1188 ± 0.0014 Å |
α | 90° |
β | 105.631 ± 0.004° |
γ | 90° |
Cell volume | 3275.8 ± 0.5 Å3 |
Cell temperature | 120 K |
Ambient diffraction temperature | 120 K |
Number of distinct elements | 6 |
Space group number | 14 |
Hermann-Mauguin space group symbol | P 1 21/c 1 |
Hall space group symbol | -P 2ybc |
Residual factor for all reflections | 0.0282 |
Residual factor for significantly intense reflections | 0.0268 |
Weighted residual factors for all reflections | 0.0653 |
Weighted residual factors for significantly intense reflections | 0.0614 |
Weighted residual factors for all reflections included in the refinement | 0.0653 |
Goodness-of-fit parameter for all reflections included in the refinement | 0.984 |
Diffraction radiation wavelength | 0.71073 Å |
Diffraction radiation type | MoKα |