Information card for entry 4342543
Formula | C30 H40 Cl N2 P Pd |
Calculated formula | C30 H38 Cl N2 P Pd |
SMILES | [Pd]12([N](=Cc3c(N2c2c([P]1(C(C)C)C(C)C)cc(cc2)C)ccc(C)c3)c1c(cc(C)cc1C)C)Cl |
Title of publication | Comparison of the Electronic Properties of Diarylamido-Based PNZ Pincer Ligands: Redox Activity at the Ligand and Donor Ability Toward the Metal. |
Authors of publication | Davidson, Jillian J.; DeMott, Jessica C.; Douvris, Christos; Fafard, Claudia M.; Bhuvanesh, Nattamai; Chen, Chun-Hsing; Herbert, David E.; Lee, Chun-I; McCulloch, Billy J.; Foxman, Bruce M.; Ozerov, Oleg V. |
Journal of publication | Inorganic chemistry |
Year of publication | 2015 |
Journal volume | 54 |
Journal issue | 6 |
Pages of publication | 2916 - 2935 |
a | 14.327 ± 0.007 Å |
b | 12.273 ± 0.006 Å |
c | 16.08 ± 0.008 Å |
α | 90° |
β | 95.796 ± 0.005° |
γ | 90° |
Cell volume | 2813 ± 2 Å3 |
Cell temperature | 296 ± 2 K |
Ambient diffraction temperature | 296 ± 2 K |
Number of distinct elements | 6 |
Space group number | 14 |
Hermann-Mauguin space group symbol | P 1 21/n 1 |
Hall space group symbol | -P 2yn |
Residual factor for all reflections | 0.0383 |
Residual factor for significantly intense reflections | 0.027 |
Weighted residual factors for significantly intense reflections | 0.0582 |
Weighted residual factors for all reflections included in the refinement | 0.0612 |
Goodness-of-fit parameter for all reflections included in the refinement | 0.923 |
Diffraction radiation wavelength | 0.71073 Å |
Diffraction radiation type | MoKα |