Information card for entry 4342607
Formula | C19 H54 N4 Si6 U |
Calculated formula | C19 H54 N4 Si6 U |
SMILES | [C]#[N][U](N([Si](C)(C)C)[Si](C)(C)C)(N([Si](C)(C)C)[Si](C)(C)C)N([Si](C)(C)C)[Si](C)(C)C |
Title of publication | U(III)-CN versus U(IV)-NC Coordination in Tris(silylamide) Complexes. |
Authors of publication | Hervé, Alexandre; Bouzidi, Yamina; Berthet, Jean-Claude; Belkhiri, Lotfi; Thuéry, Pierre; Boucekkine, Abdou; Ephritikhine, Michel |
Journal of publication | Inorganic chemistry |
Year of publication | 2015 |
Journal volume | 54 |
Journal issue | 5 |
Pages of publication | 2474 |
a | 18.4684 ± 0.0006 Å |
b | 18.4684 ± 0.0006 Å |
c | 16.9719 ± 0.001 Å |
α | 90° |
β | 90° |
γ | 120° |
Cell volume | 5013.3 ± 0.4 Å3 |
Cell temperature | 150 ± 2 K |
Ambient diffraction temperature | 150 ± 2 K |
Number of distinct elements | 5 |
Space group number | 161 |
Hermann-Mauguin space group symbol | R 3 c :H |
Hall space group symbol | R 3 -2"c |
Residual factor for all reflections | 0.0753 |
Residual factor for significantly intense reflections | 0.0381 |
Weighted residual factors for significantly intense reflections | 0.0716 |
Weighted residual factors for all reflections included in the refinement | 0.0793 |
Goodness-of-fit parameter for all reflections included in the refinement | 0.936 |
Diffraction radiation wavelength | 0.71073 Å |
Diffraction radiation type | MoKα |