Information card for entry 4342609
Formula | C19 H54 F3 N3 O3 S Si6 U |
Calculated formula | C19 H54 F3 N3 O3 S Si6 U |
SMILES | [U](OS(=O)(=O)C(F)(F)F)(N([Si](C)(C)C)[Si](C)(C)C)(N([Si](C)(C)C)[Si](C)(C)C)N([Si](C)(C)C)[Si](C)(C)C |
Title of publication | U(III)-CN versus U(IV)-NC Coordination in Tris(silylamide) Complexes. |
Authors of publication | Hervé, Alexandre; Bouzidi, Yamina; Berthet, Jean-Claude; Belkhiri, Lotfi; Thuéry, Pierre; Boucekkine, Abdou; Ephritikhine, Michel |
Journal of publication | Inorganic chemistry |
Year of publication | 2015 |
Journal volume | 54 |
Journal issue | 5 |
Pages of publication | 2474 |
a | 11.9323 ± 0.0005 Å |
b | 12.1577 ± 0.0008 Å |
c | 12.7144 ± 0.0008 Å |
α | 87.839 ± 0.003° |
β | 87.957 ± 0.004° |
γ | 89.746 ± 0.004° |
Cell volume | 1841.98 ± 0.18 Å3 |
Cell temperature | 150 ± 2 K |
Ambient diffraction temperature | 150 ± 2 K |
Number of distinct elements | 8 |
Space group number | 2 |
Hermann-Mauguin space group symbol | P -1 |
Hall space group symbol | -P 1 |
Residual factor for all reflections | 0.0342 |
Residual factor for significantly intense reflections | 0.0269 |
Weighted residual factors for significantly intense reflections | 0.0637 |
Weighted residual factors for all reflections included in the refinement | 0.0656 |
Goodness-of-fit parameter for all reflections included in the refinement | 0.993 |
Diffraction radiation wavelength | 0.71073 Å |
Diffraction radiation type | MoKα |