Information card for entry 4342667
Formula | C55 H111 K2 O12 Si8 Tm |
Calculated formula | C55 H111 K2 O12 Si8 Tm |
Title of publication | Open-Shell Lanthanide(II+) or -(III+) Complexes Bearing σ-Silyl and Silylene Ligands: Synthesis, Structure, and Bonding Analysis. |
Authors of publication | Zitz, Rainer; Arp, Henning; Hlina, Johann; Walewska, Małgorzata; Marschner, Christoph; Szilvási, Tibor; Blom, Burgert; Baumgartner, Judith |
Journal of publication | Inorganic chemistry |
Year of publication | 2015 |
Journal volume | 54 |
Journal issue | 7 |
Pages of publication | 3306 - 3315 |
a | 17.49 ± 0.004 Å |
b | 17.847 ± 0.004 Å |
c | 26.047 ± 0.005 Å |
α | 90° |
β | 93.13 ± 0.03° |
γ | 90° |
Cell volume | 8118 ± 3 Å3 |
Cell temperature | 100 ± 2 K |
Ambient diffraction temperature | 100 ± 2 K |
Number of distinct elements | 6 |
Space group number | 14 |
Hermann-Mauguin space group symbol | P 1 21/n 1 |
Hall space group symbol | -P 2yn |
Residual factor for all reflections | 0.0684 |
Residual factor for significantly intense reflections | 0.0607 |
Weighted residual factors for significantly intense reflections | 0.1676 |
Weighted residual factors for all reflections included in the refinement | 0.1748 |
Goodness-of-fit parameter for all reflections included in the refinement | 1.103 |
Diffraction radiation wavelength | 0.71073 Å |
Diffraction radiation type | MoKα |