Information card for entry 4342668
Formula | C55 H110.5 Ho K2 O12 Si8 |
Calculated formula | C55 H110.3 Ho K2 O12 Si8 |
Title of publication | Open-Shell Lanthanide(II+) or -(III+) Complexes Bearing σ-Silyl and Silylene Ligands: Synthesis, Structure, and Bonding Analysis. |
Authors of publication | Zitz, Rainer; Arp, Henning; Hlina, Johann; Walewska, Małgorzata; Marschner, Christoph; Szilvási, Tibor; Blom, Burgert; Baumgartner, Judith |
Journal of publication | Inorganic chemistry |
Year of publication | 2015 |
Journal volume | 54 |
Journal issue | 7 |
Pages of publication | 3306 - 3315 |
a | 17.423 ± 0.004 Å |
b | 17.888 ± 0.004 Å |
c | 26.118 ± 0.005 Å |
α | 90° |
β | 92.45 ± 0.03° |
γ | 90° |
Cell volume | 8133 ± 3 Å3 |
Cell temperature | 100 ± 2 K |
Ambient diffraction temperature | 100 ± 2 K |
Number of distinct elements | 6 |
Space group number | 14 |
Hermann-Mauguin space group symbol | P 1 21/n 1 |
Hall space group symbol | -P 2yn |
Residual factor for all reflections | 0.083 |
Residual factor for significantly intense reflections | 0.0644 |
Weighted residual factors for significantly intense reflections | 0.1603 |
Weighted residual factors for all reflections included in the refinement | 0.1694 |
Goodness-of-fit parameter for all reflections included in the refinement | 1.052 |
Diffraction radiation wavelength | 0.71073 Å |
Diffraction radiation type | MoKα |