Information card for entry 4342753
Formula | Co2 H99 Na15 O111 Si2 W16 |
Calculated formula | Co2 Na15 O112 Si2 W16 |
Title of publication | Synthesis and Characterization of a Series of [M2(β-SiW8O31)2](n-) Clusters and Mechanistic Insight into the Reorganization of {β-SiW8O31} into {α-SiW9O34}. |
Authors of publication | Winter, Ross S.; Long, De-Liang; Cronin, Leroy |
Journal of publication | Inorganic chemistry |
Year of publication | 2015 |
Journal volume | 54 |
Journal issue | 8 |
Pages of publication | 4151 - 4155 |
a | 11.6818 ± 0.0004 Å |
b | 13.4196 ± 0.0003 Å |
c | 17.7103 ± 0.0006 Å |
α | 71.719 ± 0.003° |
β | 80.814 ± 0.003° |
γ | 70.188 ± 0.003° |
Cell volume | 2475.77 ± 0.14 Å3 |
Cell temperature | 150 ± 2 K |
Ambient diffraction temperature | 150 ± 2 K |
Number of distinct elements | 6 |
Space group number | 2 |
Hermann-Mauguin space group symbol | P -1 |
Hall space group symbol | -P 1 |
Residual factor for all reflections | 0.068 |
Residual factor for significantly intense reflections | 0.0405 |
Weighted residual factors for significantly intense reflections | 0.0704 |
Weighted residual factors for all reflections included in the refinement | 0.0821 |
Goodness-of-fit parameter for all reflections included in the refinement | 1.061 |
Diffraction radiation wavelength | 0.71073 Å |
Diffraction radiation type | MoKα |