Information card for entry 4342754
Formula | H99 Na15 Ni2 O111 Si2 W16 |
Calculated formula | Na15 Ni2 O110 Si2 W16 |
Title of publication | Synthesis and Characterization of a Series of [M2(β-SiW8O31)2](n-) Clusters and Mechanistic Insight into the Reorganization of {β-SiW8O31} into {α-SiW9O34}. |
Authors of publication | Winter, Ross S.; Long, De-Liang; Cronin, Leroy |
Journal of publication | Inorganic chemistry |
Year of publication | 2015 |
Journal volume | 54 |
Journal issue | 8 |
Pages of publication | 4151 - 4155 |
a | 11.6686 ± 0.0003 Å |
b | 13.411 ± 0.0004 Å |
c | 17.6506 ± 0.0004 Å |
α | 71.797 ± 0.002° |
β | 80.885 ± 0.002° |
γ | 70.251 ± 0.002° |
Cell volume | 2465.22 ± 0.12 Å3 |
Cell temperature | 150 ± 2 K |
Ambient diffraction temperature | 150 ± 2 K |
Number of distinct elements | 6 |
Space group number | 2 |
Hermann-Mauguin space group symbol | P -1 |
Hall space group symbol | -P 1 |
Residual factor for all reflections | 0.0437 |
Residual factor for significantly intense reflections | 0.032 |
Weighted residual factors for significantly intense reflections | 0.0652 |
Weighted residual factors for all reflections included in the refinement | 0.0703 |
Goodness-of-fit parameter for all reflections included in the refinement | 1.042 |
Diffraction radiation wavelength | 0.71073 Å |
Diffraction radiation type | MoKα |