Information card for entry 4342769
Formula | C62 H41 F20 N2 O3 Pt2 Tl2 |
Calculated formula | C62 H41 F20 N2 O3 Pt2 Tl2 |
Title of publication | An Extended Chain and Trinuclear Complexes Based on Pt(II)-M (M = Tl(I), Pb(II)) Bonds: Contrasting Photophysical Behavior. |
Authors of publication | Forniés, Juan; Giménez, Nora; Ibáñez, Susana; Lalinde, Elena; Martín, Antonio; Moreno, M. Teresa |
Journal of publication | Inorganic chemistry |
Year of publication | 2015 |
Journal volume | 54 |
Journal issue | 9 |
Pages of publication | 4351 - 4363 |
a | 13.54776 ± 0.00017 Å |
b | 22.975 ± 0.0002 Å |
c | 20.6916 ± 0.0002 Å |
α | 90° |
β | 108.326 ± 0.0013° |
γ | 90° |
Cell volume | 6113.81 ± 0.12 Å3 |
Cell temperature | 100 ± 2 K |
Ambient diffraction temperature | 100 ± 2 K |
Number of distinct elements | 7 |
Space group number | 14 |
Hermann-Mauguin space group symbol | P 1 21/n 1 |
Hall space group symbol | -P 2yn |
Residual factor for all reflections | 0.0373 |
Residual factor for significantly intense reflections | 0.0291 |
Weighted residual factors for significantly intense reflections | 0.0754 |
Weighted residual factors for all reflections included in the refinement | 0.0773 |
Goodness-of-fit parameter for all reflections included in the refinement | 1.021 |
Diffraction radiation wavelength | 0.71073 Å |
Diffraction radiation type | MoKα |