Information card for entry 4342770
Formula | C66.75 H53.5 Cl1.5 F20 N3 Pt2 Tl |
Calculated formula | C66.75 H53.5 Cl1.5 F20 N3 Pt2 Tl |
Title of publication | An Extended Chain and Trinuclear Complexes Based on Pt(II)-M (M = Tl(I), Pb(II)) Bonds: Contrasting Photophysical Behavior. |
Authors of publication | Forniés, Juan; Giménez, Nora; Ibáñez, Susana; Lalinde, Elena; Martín, Antonio; Moreno, M. Teresa |
Journal of publication | Inorganic chemistry |
Year of publication | 2015 |
Journal volume | 54 |
Journal issue | 9 |
Pages of publication | 4351 - 4363 |
a | 15.6391 ± 0.0003 Å |
b | 21.9389 ± 0.0003 Å |
c | 21.3206 ± 0.0005 Å |
α | 90° |
β | 109.132 ± 0.003° |
γ | 90° |
Cell volume | 6911.1 ± 0.3 Å3 |
Cell temperature | 150 ± 2 K |
Ambient diffraction temperature | 150 ± 2 K |
Number of distinct elements | 7 |
Space group number | 14 |
Hermann-Mauguin space group symbol | P 1 21/n 1 |
Hall space group symbol | -P 2yn |
Residual factor for all reflections | 0.0784 |
Residual factor for significantly intense reflections | 0.0412 |
Weighted residual factors for significantly intense reflections | 0.0994 |
Weighted residual factors for all reflections included in the refinement | 0.1145 |
Goodness-of-fit parameter for all reflections included in the refinement | 1.026 |
Diffraction radiation wavelength | 0.71073 Å |
Diffraction radiation type | MoKα |