Information card for entry 4342772
Formula | C70 H60 F20 N3 O Pt2 Tl |
Calculated formula | C70 H60 F20 N3 O Pt2 Tl |
SMILES | [Pt]1([Tl]([Pt]2([n]3cccc4ccc5cccc2c5c34)(c2c(F)c(F)c(F)c(F)c2F)c2c(F)c(F)c(F)c(F)c2F)[O]2CCCC2)([n]2cccc3ccc4cccc1c4c23)(c1c(F)c(F)c(F)c(F)c1F)c1c(F)c(F)c(F)c(F)c1F.[N+](CCCC)(CCCC)(CCCC)CCCC |
Title of publication | An Extended Chain and Trinuclear Complexes Based on Pt(II)-M (M = Tl(I), Pb(II)) Bonds: Contrasting Photophysical Behavior. |
Authors of publication | Forniés, Juan; Giménez, Nora; Ibáñez, Susana; Lalinde, Elena; Martín, Antonio; Moreno, M. Teresa |
Journal of publication | Inorganic chemistry |
Year of publication | 2015 |
Journal volume | 54 |
Journal issue | 9 |
Pages of publication | 4351 - 4363 |
a | 20.866 ± 0.004 Å |
b | 20.269 ± 0.004 Å |
c | 31.102 ± 0.006 Å |
α | 90° |
β | 90° |
γ | 90° |
Cell volume | 13154 ± 4 Å3 |
Cell temperature | 173 ± 2 K |
Ambient diffraction temperature | 173 ± 2 K |
Number of distinct elements | 7 |
Space group number | 61 |
Hermann-Mauguin space group symbol | P b c a |
Hall space group symbol | -P 2ac 2ab |
Residual factor for all reflections | 0.0567 |
Residual factor for significantly intense reflections | 0.0306 |
Weighted residual factors for significantly intense reflections | 0.0588 |
Weighted residual factors for all reflections included in the refinement | 0.0655 |
Goodness-of-fit parameter for all reflections included in the refinement | 1.02 |
Diffraction radiation wavelength | 0.71073 Å |
Diffraction radiation type | MoKα |