Information card for entry 4342771
Formula | C67 H54 Cl2 F20 N3 Pt2 Tl |
Calculated formula | C67 H54 Cl2 F20 N3 Pt2 Tl |
Title of publication | An Extended Chain and Trinuclear Complexes Based on Pt(II)-M (M = Tl(I), Pb(II)) Bonds: Contrasting Photophysical Behavior. |
Authors of publication | Forniés, Juan; Giménez, Nora; Ibáñez, Susana; Lalinde, Elena; Martín, Antonio; Moreno, M. Teresa |
Journal of publication | Inorganic chemistry |
Year of publication | 2015 |
Journal volume | 54 |
Journal issue | 9 |
Pages of publication | 4351 - 4363 |
a | 13.6874 ± 0.0002 Å |
b | 19.5947 ± 0.0003 Å |
c | 24.0397 ± 0.0004 Å |
α | 90° |
β | 101.701 ± 0.0015° |
γ | 90° |
Cell volume | 6313.47 ± 0.17 Å3 |
Cell temperature | 100 ± 2 K |
Ambient diffraction temperature | 100 ± 2 K |
Number of distinct elements | 7 |
Space group number | 14 |
Hermann-Mauguin space group symbol | P 1 21/c 1 |
Hall space group symbol | -P 2ybc |
Residual factor for all reflections | 0.058 |
Residual factor for significantly intense reflections | 0.0378 |
Weighted residual factors for significantly intense reflections | 0.0788 |
Weighted residual factors for all reflections included in the refinement | 0.083 |
Goodness-of-fit parameter for all reflections included in the refinement | 1.016 |
Diffraction radiation wavelength | 0.71073 Å |
Diffraction radiation type | MoKα |