Information card for entry 4342790
Formula | C22 H34 N4 Ni O S2 |
Calculated formula | C22 H34 N4 Ni O S2 |
SMILES | [Ni]12(SCCN1C(=O)c1[n]2cccc1)Sc1ccc(N)cc1.[N+](CC)(CC)(CC)CC |
Title of publication | Accessing Ni(III)-Thiolate Versus Ni(II)-Thiyl Bonding in a Family of Ni-N2S2 Synthetic Models of NiSOD. |
Authors of publication | Broering, Ellen P.; Dillon, Stephanie; Gale, Eric M.; Steiner, Ramsey A.; Telser, Joshua; Brunold, Thomas C.; Harrop, Todd C. |
Journal of publication | Inorganic chemistry |
Year of publication | 2015 |
Journal volume | 54 |
Journal issue | 8 |
Pages of publication | 3815 - 3828 |
a | 20.0499 ± 0.0012 Å |
b | 11.801 ± 0.0007 Å |
c | 20.4272 ± 0.0013 Å |
α | 90° |
β | 100.585 ± 0.001° |
γ | 90° |
Cell volume | 4751 ± 0.5 Å3 |
Cell temperature | 100 ± 2 K |
Ambient diffraction temperature | 100 ± 2 K |
Number of distinct elements | 6 |
Space group number | 14 |
Hermann-Mauguin space group symbol | P 1 21/c 1 |
Hall space group symbol | -P 2ybc |
Residual factor for all reflections | 0.0492 |
Residual factor for significantly intense reflections | 0.0371 |
Weighted residual factors for significantly intense reflections | 0.0959 |
Weighted residual factors for all reflections included in the refinement | 0.1028 |
Goodness-of-fit parameter for all reflections included in the refinement | 1.021 |
Diffraction radiation wavelength | 0.71073 Å |
Diffraction radiation type | MoKα |