Information card for entry 4342803
Formula | C43 H47 N9 O21 Zn4 |
Calculated formula | C43 H47 N10 O21 Zn4 |
Title of publication | Thermodynamic Study of CO2 Sorption by Polymorphic Microporous MOFs with Open Zn(II) Coordination Sites. |
Authors of publication | Ahrenholtz, Spencer R.; Landaverde-Alvarado, Carlos; Whiting, Macauley; Lin, Shaoyang; Slebodnick, Carla; Marand, Eva; Morris, Amanda J. |
Journal of publication | Inorganic chemistry |
Year of publication | 2015 |
Journal volume | 54 |
Journal issue | 9 |
Pages of publication | 4328 - 4336 |
a | 14.0003 ± 0.0003 Å |
b | 12.1692 ± 0.0002 Å |
c | 14.6711 ± 0.0003 Å |
α | 90° |
β | 105.867 ± 0.002° |
γ | 90° |
Cell volume | 2404.32 ± 0.08 Å3 |
Cell temperature | 100 ± 1 K |
Ambient diffraction temperature | 100 ± 1 K |
Number of distinct elements | 5 |
Space group number | 14 |
Hermann-Mauguin space group symbol | P 1 21/n 1 |
Hall space group symbol | -P 2yn |
Residual factor for all reflections | 0.0762 |
Residual factor for significantly intense reflections | 0.0468 |
Weighted residual factors for significantly intense reflections | 0.1008 |
Weighted residual factors for all reflections included in the refinement | 0.115 |
Goodness-of-fit parameter for all reflections included in the refinement | 1.04 |
Diffraction radiation wavelength | 0.7107 Å |
Diffraction radiation type | MoKα |