Information card for entry 4342804
Formula | C19 H17 N3 O9 Zn2 |
Calculated formula | C19 H17 N3 O9 Zn2 |
Title of publication | Thermodynamic Study of CO2 Sorption by Polymorphic Microporous MOFs with Open Zn(II) Coordination Sites. |
Authors of publication | Ahrenholtz, Spencer R.; Landaverde-Alvarado, Carlos; Whiting, Macauley; Lin, Shaoyang; Slebodnick, Carla; Marand, Eva; Morris, Amanda J. |
Journal of publication | Inorganic chemistry |
Year of publication | 2015 |
Journal volume | 54 |
Journal issue | 9 |
Pages of publication | 4328 - 4336 |
a | 12.23325 ± 0.00019 Å |
b | 17.4883 ± 0.0003 Å |
c | 20.3322 ± 0.0005 Å |
α | 90° |
β | 90° |
γ | 90° |
Cell volume | 4349.85 ± 0.15 Å3 |
Cell temperature | 100 K |
Ambient diffraction temperature | 100 K |
Number of distinct elements | 5 |
Space group number | 61 |
Hermann-Mauguin space group symbol | P b c a |
Hall space group symbol | -P 2ac 2ab |
Residual factor for all reflections | 0.0677 |
Residual factor for significantly intense reflections | 0.0492 |
Weighted residual factors for significantly intense reflections | 0.1036 |
Weighted residual factors for all reflections included in the refinement | 0.1112 |
Goodness-of-fit parameter for all reflections included in the refinement | 1.11 |
Diffraction radiation probe | x-ray |
Diffraction radiation wavelength | 0.71073 Å |
Diffraction radiation type | MoKα |