Information card for entry 4342811
Formula | C24 H79 N24 O62 Pt3 |
Calculated formula | C24 H29 N24 O37 Pt3 |
Title of publication | Polynuclear Hydroxido-Bridged Complexes of Platinum(IV) with Terminal Nitrato Ligands. |
Authors of publication | Vasilchenko, Danila; Berdugin, Semen; Tkachev, Sergey; Baidina, Iraida; Romanenko, Galina; Gerasko, Olga; Korenev, Sergey |
Journal of publication | Inorganic chemistry |
Year of publication | 2015 |
Journal volume | 54 |
Journal issue | 10 |
Pages of publication | 4644 - 4651 |
a | 13.1408 ± 0.0007 Å |
b | 14.8737 ± 0.0008 Å |
c | 17.967 ± 0.0009 Å |
α | 70.471 ± 0.002° |
β | 72.032 ± 0.002° |
γ | 88.713 ± 0.002° |
Cell volume | 3135.5 ± 0.3 Å3 |
Cell temperature | 150 ± 2 K |
Ambient diffraction temperature | 150.15 K |
Number of distinct elements | 5 |
Space group number | 2 |
Hermann-Mauguin space group symbol | P -1 |
Hall space group symbol | -P 1 |
Residual factor for all reflections | 0.1062 |
Residual factor for significantly intense reflections | 0.066 |
Weighted residual factors for significantly intense reflections | 0.1914 |
Weighted residual factors for all reflections included in the refinement | 0.2039 |
Goodness-of-fit parameter for all reflections included in the refinement | 1.101 |
Diffraction radiation probe | x-ray |
Diffraction radiation wavelength | 0.71073 Å |
Diffraction radiation type | MoKα |