Information card for entry 4342812
Formula | C36 H92 N34 O73 Pt4 |
Calculated formula | C36 H42 N34 O48 Pt4 |
SMILES | C12C3N4C(=O)N2CN2C5C6N(C2=O)CN2C(=O)N7CN8C9C%10N(CN%11C%12C%13N%14C(=O)N%12CN%10C(=O)N9CN9C7C2N(CN6C(=O)N5CN1C(=O)N3CN1C2C(N(C1=O)C%14)N(CN%13C%11=O)C(=O)N2C4)C9=O)C8=O.N(=O)(=O)O[Pt]123([OH]4[Pt]([OH]1)(ON(=O)=O)(ON(=O)=O)(ON(=O)=O)[OH][Pt]14([OH]3[Pt]([OH]2)([OH]1)(ON(=O)=O)(ON(=O)=O)ON(=O)=O)(ON(=O)=O)ON(=O)=O)ON(=O)=O |
Title of publication | Polynuclear Hydroxido-Bridged Complexes of Platinum(IV) with Terminal Nitrato Ligands. |
Authors of publication | Vasilchenko, Danila; Berdugin, Semen; Tkachev, Sergey; Baidina, Iraida; Romanenko, Galina; Gerasko, Olga; Korenev, Sergey |
Journal of publication | Inorganic chemistry |
Year of publication | 2015 |
Journal volume | 54 |
Journal issue | 10 |
Pages of publication | 4644 - 4651 |
a | 11.13 ± 0.002 Å |
b | 14.73 ± 0.003 Å |
c | 15.637 ± 0.003 Å |
α | 66.238 ± 0.005° |
β | 71.669 ± 0.005° |
γ | 79.704 ± 0.005° |
Cell volume | 2223.2 ± 0.7 Å3 |
Cell temperature | 296 ± 2 K |
Ambient diffraction temperature | 296 ± 2 K |
Number of distinct elements | 5 |
Space group number | 2 |
Hermann-Mauguin space group symbol | P -1 |
Hall space group symbol | -P 1 |
Residual factor for all reflections | 0.0668 |
Residual factor for significantly intense reflections | 0.0362 |
Weighted residual factors for significantly intense reflections | 0.0743 |
Weighted residual factors for all reflections included in the refinement | 0.0791 |
Goodness-of-fit parameter for all reflections included in the refinement | 0.906 |
Diffraction radiation probe | x-ray |
Diffraction radiation wavelength | 0.71073 Å |
Diffraction radiation type | MoKα |