Information card for entry 4342813
Formula | C24 H62 N18 O76 Pt6 |
Calculated formula | C24 H8 N18 O76 Pt6 |
Title of publication | Polynuclear Hydroxido-Bridged Complexes of Platinum(IV) with Terminal Nitrato Ligands. |
Authors of publication | Vasilchenko, Danila; Berdugin, Semen; Tkachev, Sergey; Baidina, Iraida; Romanenko, Galina; Gerasko, Olga; Korenev, Sergey |
Journal of publication | Inorganic chemistry |
Year of publication | 2015 |
Journal volume | 54 |
Journal issue | 10 |
Pages of publication | 4644 - 4651 |
a | 12.303 ± 0.008 Å |
b | 12.691 ± 0.009 Å |
c | 18.188 ± 0.009 Å |
α | 82.03 ± 0.02° |
β | 76.276 ± 0.017° |
γ | 81.987 ± 0.018° |
Cell volume | 2715 ± 3 Å3 |
Cell temperature | 296 ± 2 K |
Ambient diffraction temperature | 296 ± 2 K |
Number of distinct elements | 5 |
Space group number | 2 |
Hermann-Mauguin space group symbol | P -1 |
Hall space group symbol | -P 1 |
Residual factor for all reflections | 0.0957 |
Residual factor for significantly intense reflections | 0.0572 |
Weighted residual factors for significantly intense reflections | 0.1654 |
Weighted residual factors for all reflections included in the refinement | 0.1832 |
Goodness-of-fit parameter for all reflections included in the refinement | 1.01 |
Diffraction radiation probe | x-ray |
Diffraction radiation wavelength | 0.71073 Å |
Diffraction radiation type | MoKα |