Information card for entry 4342820
Formula | C32 H30 F12 N8 O0.25 P2 Ru |
Calculated formula | C32 H30 F12 N8 O0.25 P2 Ru |
Title of publication | Tuning ligand effects and probing the inner-workings of bond activation steps: generation of ruthenium complexes with tailor-made properties. |
Authors of publication | Weisser, Fritz; Plebst, Sebastian; Hohloch, Stephan; van der Meer, Margarethe; Manck, Sinja; Führer, Felix; Radtke, Vanessa; Leichnitz, Daniel; Sarkar, Biprajit |
Journal of publication | Inorganic chemistry |
Year of publication | 2015 |
Journal volume | 54 |
Journal issue | 10 |
Pages of publication | 4621 - 4635 |
a | 17.888 ± 0.005 Å |
b | 18.35 ± 0.006 Å |
c | 22.569 ± 0.007 Å |
α | 90° |
β | 90° |
γ | 90° |
Cell volume | 7408 ± 4 Å3 |
Cell temperature | 100 ± 2 K |
Ambient diffraction temperature | 100 ± 2 K |
Number of distinct elements | 7 |
Space group number | 54 |
Hermann-Mauguin space group symbol | P c c a |
Hall space group symbol | -P 2a 2ac |
Residual factor for all reflections | 0.0944 |
Residual factor for significantly intense reflections | 0.0667 |
Weighted residual factors for significantly intense reflections | 0.1803 |
Weighted residual factors for all reflections included in the refinement | 0.2081 |
Goodness-of-fit parameter for all reflections included in the refinement | 1.059 |
Diffraction radiation wavelength | 0.71073 Å |
Diffraction radiation type | MoKα |