Information card for entry 4342821
Formula | C37 H38 F12 N10 O P2 Ru |
Calculated formula | C37 H38 F12 N10 O P2 Ru |
SMILES | [Ru]1234([N](Cc5[n]1cccc5)(Cc1[n]3nn(Cc3ccccc3)c1)Cc1[n]4nn(Cc3ccccc3)c1)[n]1c(cccc1)c1[n]2cccc1.[P](F)(F)(F)(F)(F)[F-].[P](F)(F)(F)(F)(F)[F-].OC |
Title of publication | Tuning ligand effects and probing the inner-workings of bond activation steps: generation of ruthenium complexes with tailor-made properties. |
Authors of publication | Weisser, Fritz; Plebst, Sebastian; Hohloch, Stephan; van der Meer, Margarethe; Manck, Sinja; Führer, Felix; Radtke, Vanessa; Leichnitz, Daniel; Sarkar, Biprajit |
Journal of publication | Inorganic chemistry |
Year of publication | 2015 |
Journal volume | 54 |
Journal issue | 10 |
Pages of publication | 4621 - 4635 |
a | 11.138 ± 0.003 Å |
b | 12.996 ± 0.004 Å |
c | 14.487 ± 0.004 Å |
α | 78.682 ± 0.005° |
β | 87.424 ± 0.006° |
γ | 84.084 ± 0.006° |
Cell volume | 2044.6 ± 1 Å3 |
Cell temperature | 100 ± 2 K |
Ambient diffraction temperature | 100 ± 2 K |
Number of distinct elements | 7 |
Space group number | 2 |
Hermann-Mauguin space group symbol | P -1 |
Hall space group symbol | -P 1 |
Residual factor for all reflections | 0.0971 |
Residual factor for significantly intense reflections | 0.0596 |
Weighted residual factors for significantly intense reflections | 0.1371 |
Weighted residual factors for all reflections included in the refinement | 0.1551 |
Goodness-of-fit parameter for all reflections included in the refinement | 1.056 |
Diffraction radiation wavelength | 0.71073 Å |
Diffraction radiation type | MoKα |