Information card for entry 4342871
Formula | C62 H51 Cl4 Ho N8 O7 |
Calculated formula | C62 H51 Cl4 Ho N8 O7 |
SMILES | [Ho]1234567[N]8=Cc9c(c(CN(Cc%10c(c(cc(c%10)Cl)C=[N]3c3c(cccc3)[N]2=Cc2c(c(CN(Cc3c(c(C=[N]1c1c8cccc1)cc(c3)Cl)[OH]6)CCc1ccccc1)cc(c2)Cl)[OH]7)O4)CCc1ccccc1)cc(c9)Cl)O5.C(#N)C.N(=O)(=O)[O-] |
Title of publication | Construction of Identical [2 + 2] Schiff-Base Macrocyclic Ligands by Ln(III) and Zn(II) Template Ions Including Efficient Yb(III) Near-Infrared Sensitizers. |
Authors of publication | Zhang, Kun; Zhang, Lei; Zhang, Song; Hu, Yong; Zheng, Youxuan; Huang, Wei |
Journal of publication | Inorganic chemistry |
Year of publication | 2015 |
Journal volume | 54 |
Journal issue | 11 |
Pages of publication | 5295 - 5300 |
a | 19.03 ± 0.004 Å |
b | 21.908 ± 0.005 Å |
c | 13.942 ± 0.003 Å |
α | 90° |
β | 104.955 ± 0.004° |
γ | 90° |
Cell volume | 5616 ± 2 Å3 |
Cell temperature | 291 ± 2 K |
Ambient diffraction temperature | 291 ± 2 K |
Number of distinct elements | 6 |
Space group number | 14 |
Hermann-Mauguin space group symbol | P 1 21/c 1 |
Hall space group symbol | -P 2ybc |
Residual factor for all reflections | 0.0516 |
Residual factor for significantly intense reflections | 0.0346 |
Weighted residual factors for significantly intense reflections | 0.0852 |
Weighted residual factors for all reflections included in the refinement | 0.0911 |
Goodness-of-fit parameter for all reflections included in the refinement | 1.031 |
Diffraction radiation wavelength | 0.71073 Å |
Diffraction radiation type | MoKα |