Information card for entry 4342872
Formula | C62 H56 Cl4 N8 O14 Zn2 |
Calculated formula | C62 H56 Cl4 N8 O14 Zn2 |
Title of publication | Construction of Identical [2 + 2] Schiff-Base Macrocyclic Ligands by Ln(III) and Zn(II) Template Ions Including Efficient Yb(III) Near-Infrared Sensitizers. |
Authors of publication | Zhang, Kun; Zhang, Lei; Zhang, Song; Hu, Yong; Zheng, Youxuan; Huang, Wei |
Journal of publication | Inorganic chemistry |
Year of publication | 2015 |
Journal volume | 54 |
Journal issue | 11 |
Pages of publication | 5295 - 5300 |
a | 13.254 ± 0.005 Å |
b | 14.856 ± 0.006 Å |
c | 16.855 ± 0.007 Å |
α | 67.948 ± 0.007° |
β | 78.837 ± 0.007° |
γ | 76.295 ± 0.006° |
Cell volume | 2968 ± 2 Å3 |
Cell temperature | 291 ± 2 K |
Ambient diffraction temperature | 291 ± 2 K |
Number of distinct elements | 6 |
Space group number | 2 |
Hermann-Mauguin space group symbol | P -1 |
Hall space group symbol | -P 1 |
Residual factor for all reflections | 0.1549 |
Residual factor for significantly intense reflections | 0.0657 |
Weighted residual factors for significantly intense reflections | 0.1152 |
Weighted residual factors for all reflections included in the refinement | 0.1347 |
Goodness-of-fit parameter for all reflections included in the refinement | 1 |
Diffraction radiation wavelength | 0.71073 Å |
Diffraction radiation type | MoKα |