Information card for entry 4342876
Formula | C26 H25 Mo N14 O7 Pr |
Calculated formula | C26 H25 Mo N14 O7 Pr |
Title of publication | Visible to Near-Infrared Emission from Ln(III)(Bis-oxazoline)-[Mo(V)(CN)8] (Ln = Ce-Yb) Magnetic Coordination Polymers Showing Unusual Lanthanide-Dependent Sliding of Cyanido-Bridged Layers. |
Authors of publication | Chorazy, Szymon; Arczynski, Mirosław; Nakabayashi, Koji; Sieklucka, Barbara; Ohkoshi, Shin-Ichi |
Journal of publication | Inorganic chemistry |
Year of publication | 2015 |
Journal volume | 54 |
Journal issue | 10 |
Pages of publication | 4724 - 4736 |
a | 12.5363 ± 0.0009 Å |
b | 19.9887 ± 0.0014 Å |
c | 14.015 ± 0.0009 Å |
α | 90° |
β | 93.063 ± 0.002° |
γ | 90° |
Cell volume | 3506.9 ± 0.4 Å3 |
Cell temperature | 90 ± 2 K |
Ambient diffraction temperature | 90 ± 2 K |
Number of distinct elements | 6 |
Space group number | 14 |
Hermann-Mauguin space group symbol | P 1 21/n 1 |
Hall space group symbol | -P 2yn |
Residual factor for all reflections | 0.1121 |
Residual factor for significantly intense reflections | 0.066 |
Weighted residual factors for significantly intense reflections | 0.1516 |
Weighted residual factors for all reflections included in the refinement | 0.1788 |
Goodness-of-fit parameter for all reflections included in the refinement | 0.982 |
Diffraction radiation wavelength | 0.71075 Å |
Diffraction radiation type | MoKα |