Information card for entry 4342877
Formula | C58 H50 Mo2 N31 Nd2 O12 |
Calculated formula | C58 H50 Mo2 N31 Nd2 O12 |
Title of publication | Visible to Near-Infrared Emission from Ln(III)(Bis-oxazoline)-[Mo(V)(CN)8] (Ln = Ce-Yb) Magnetic Coordination Polymers Showing Unusual Lanthanide-Dependent Sliding of Cyanido-Bridged Layers. |
Authors of publication | Chorazy, Szymon; Arczynski, Mirosław; Nakabayashi, Koji; Sieklucka, Barbara; Ohkoshi, Shin-Ichi |
Journal of publication | Inorganic chemistry |
Year of publication | 2015 |
Journal volume | 54 |
Journal issue | 10 |
Pages of publication | 4724 - 4736 |
a | 10.6983 ± 0.0003 Å |
b | 19.2456 ± 0.0007 Å |
c | 19.369 ± 0.0008 Å |
α | 84.116 ± 0.001° |
β | 82.822 ± 0.001° |
γ | 76.653 ± 0.001° |
Cell volume | 3838.6 ± 0.2 Å3 |
Cell temperature | 90 ± 2 K |
Ambient diffraction temperature | 90 ± 2 K |
Number of distinct elements | 6 |
Space group number | 2 |
Hermann-Mauguin space group symbol | P -1 |
Hall space group symbol | -P 1 |
Residual factor for all reflections | 0.1929 |
Residual factor for significantly intense reflections | 0.0994 |
Weighted residual factors for significantly intense reflections | 0.2298 |
Weighted residual factors for all reflections included in the refinement | 0.3189 |
Goodness-of-fit parameter for all reflections included in the refinement | 1.079 |
Diffraction radiation wavelength | 0.71075 Å |
Diffraction radiation type | MoKα |