Information card for entry 4342897
Common name | Na[HFe(CNArMes2)4] |
Formula | C105 H113 Fe N4 Na |
Calculated formula | C105 H113 Fe N4 Na |
SMILES | C(#[N]c1c(cccc1c1c(cc(cc1C)C)C)c1c(cc(cc1C)C)C)[FeH](C#[N]c1c(cccc1c1c(cc(cc1C)C)C)c1c(cc(cc1C)C)C)(C#[N]c1c(cccc1c1c(cc(cc1C)C)C)c1c(cc(cc1C)C)C)C#[N]c1c(cccc1c1c(cc(cc1C)C)C)c1c(cc(C)cc1C)C.[Na+].CCCCC |
Title of publication | Synthesis and protonation of an encumbered iron tetraisocyanide dianion. |
Authors of publication | Mokhtarzadeh, Charles C.; Margulieux, Grant W.; Carpenter, Alex E.; Weidemann, Nils; Moore, Curtis E.; Rheingold, Arnold L.; Figueroa, Joshua S. |
Journal of publication | Inorganic chemistry |
Year of publication | 2015 |
Journal volume | 54 |
Journal issue | 11 |
Pages of publication | 5579 - 5587 |
a | 13.4873 ± 0.001 Å |
b | 27.8985 ± 0.0017 Å |
c | 22.7298 ± 0.0014 Å |
α | 90° |
β | 90.479 ± 0.005° |
γ | 90° |
Cell volume | 8552.4 ± 1 Å3 |
Cell temperature | 100 K |
Ambient diffraction temperature | 100 K |
Number of distinct elements | 5 |
Space group number | 14 |
Hermann-Mauguin space group symbol | P 1 21/n 1 |
Hall space group symbol | -P 2yn |
Residual factor for all reflections | 0.0941 |
Residual factor for significantly intense reflections | 0.0556 |
Weighted residual factors for significantly intense reflections | 0.1222 |
Weighted residual factors for all reflections included in the refinement | 0.1352 |
Goodness-of-fit parameter for all reflections included in the refinement | 1.007 |
Diffraction radiation probe | x-ray |
Diffraction radiation wavelength | 1.54178 Å |
Diffraction radiation type | CuKα |