Information card for entry 4342898
Common name | Fe(N2)(CNArMes2)4 |
Formula | C100 H100 Fe N6 |
Calculated formula | C100 H100 Fe N6 |
SMILES | C(#[N]c1c(cccc1c1c(cc(cc1C)C)C)c1c(cc(cc1C)C)C)[Fe](C#[N]c1c(cccc1c1c(cc(cc1C)C)C)c1c(cc(cc1C)C)C)([N]#N)(C#[N]c1c(cccc1c1c(cc(cc1C)C)C)c1c(cc(cc1C)C)C)C#[N]c1c(cccc1c1c(cc(cc1C)C)C)c1c(cc(cc1C)C)C |
Title of publication | Synthesis and protonation of an encumbered iron tetraisocyanide dianion. |
Authors of publication | Mokhtarzadeh, Charles C.; Margulieux, Grant W.; Carpenter, Alex E.; Weidemann, Nils; Moore, Curtis E.; Rheingold, Arnold L.; Figueroa, Joshua S. |
Journal of publication | Inorganic chemistry |
Year of publication | 2015 |
Journal volume | 54 |
Journal issue | 11 |
Pages of publication | 5579 - 5587 |
a | 16.195 ± 0.002 Å |
b | 23.161 ± 0.003 Å |
c | 21.453 ± 0.003 Å |
α | 90° |
β | 97.426 ± 0.006° |
γ | 90° |
Cell volume | 7979.4 ± 1.8 Å3 |
Cell temperature | 100 K |
Ambient diffraction temperature | 100 K |
Number of distinct elements | 4 |
Space group number | 15 |
Hermann-Mauguin space group symbol | C 1 2/c 1 |
Hall space group symbol | -C 2yc |
Residual factor for all reflections | 0.0778 |
Residual factor for significantly intense reflections | 0.0441 |
Weighted residual factors for significantly intense reflections | 0.0935 |
Weighted residual factors for all reflections included in the refinement | 0.1046 |
Goodness-of-fit parameter for all reflections included in the refinement | 1.016 |
Diffraction radiation probe | x-ray |
Diffraction radiation wavelength | 0.71073 Å |
Diffraction radiation type | MoKα |