Information card for entry 4342900
Common name | cyclo-CNArMes2_imine |
Formula | C25 H25 N |
Calculated formula | C25 H25 N |
SMILES | N1=CCc2cc(C)cc(c2c2c1c(c1c(cc(C)cc1C)C)ccc2)C |
Title of publication | Synthesis and protonation of an encumbered iron tetraisocyanide dianion. |
Authors of publication | Mokhtarzadeh, Charles C.; Margulieux, Grant W.; Carpenter, Alex E.; Weidemann, Nils; Moore, Curtis E.; Rheingold, Arnold L.; Figueroa, Joshua S. |
Journal of publication | Inorganic chemistry |
Year of publication | 2015 |
Journal volume | 54 |
Journal issue | 11 |
Pages of publication | 5579 - 5587 |
a | 13.7638 ± 0.0011 Å |
b | 7.245 ± 0.0005 Å |
c | 18.9715 ± 0.0015 Å |
α | 90° |
β | 96.205 ± 0.003° |
γ | 90° |
Cell volume | 1880.7 ± 0.2 Å3 |
Cell temperature | 100 K |
Ambient diffraction temperature | 100 K |
Number of distinct elements | 3 |
Space group number | 14 |
Hermann-Mauguin space group symbol | P 1 21/n 1 |
Hall space group symbol | -P 2yn |
Residual factor for all reflections | 0.0868 |
Residual factor for significantly intense reflections | 0.0492 |
Weighted residual factors for significantly intense reflections | 0.1026 |
Weighted residual factors for all reflections included in the refinement | 0.1188 |
Goodness-of-fit parameter for all reflections included in the refinement | 1.024 |
Diffraction radiation probe | x-ray |
Diffraction radiation wavelength | 0.71073 Å |
Diffraction radiation type | MoKα |