Information card for entry 4342901
Formula | C20 H18 O4 Te |
Calculated formula | C20 H18 O4 Te |
SMILES | [Te]1(OC(=O)C)(OC(=O)C)C(=CC=C1c1ccccc1)c1ccccc1 |
Title of publication | Te(II)/Te(IV) Mediated C-N Bond Formation on 2,5-Diphenyltellurophene and a Reassignment of the Product from the Reaction of PhI(OAc)2 with 2 TMS-OTf. |
Authors of publication | Aprile, Antonino; Iversen, Kalon J.; Wilson, David J. D.; Dutton, Jason L. |
Journal of publication | Inorganic chemistry |
Year of publication | 2015 |
Journal volume | 54 |
Journal issue | 10 |
Pages of publication | 4934 - 4939 |
a | 8.5259 ± 0.0017 Å |
b | 10.197 ± 0.002 Å |
c | 10.315 ± 0.002 Å |
α | 91.18 ± 0.03° |
β | 99.6 ± 0.03° |
γ | 94.89 ± 0.03° |
Cell volume | 880.4 ± 0.3 Å3 |
Cell temperature | 173 ± 2 K |
Ambient diffraction temperature | 173 ± 2 K |
Number of distinct elements | 4 |
Space group number | 2 |
Hermann-Mauguin space group symbol | P -1 |
Hall space group symbol | -P 1 |
Residual factor for all reflections | 0.0648 |
Residual factor for significantly intense reflections | 0.0628 |
Weighted residual factors for significantly intense reflections | 0.1702 |
Weighted residual factors for all reflections included in the refinement | 0.1733 |
Goodness-of-fit parameter for all reflections included in the refinement | 1.075 |
Diffraction radiation wavelength | 0.71073 Å |
Diffraction radiation type | MoKα |