Information card for entry 4342905
Formula | C105 H126 Ge2 N6 O10 P4 Ru4 Si4 |
Calculated formula | C105 H126 Ge2 N6 O10 P4 Ru4 Si4 |
Title of publication | Reactivity Studies on a Binuclear Ruthenium(0) Complex Equipped with a Bridging κ(2)N,Ge-Amidinatogermylene Ligand. |
Authors of publication | Cabeza, Javier A.; Fernández-Colinas, José M; García-Álvarez, Pablo; Pérez-Carreño, Enrique; Polo, Diego |
Journal of publication | Inorganic chemistry |
Year of publication | 2015 |
Journal volume | 54 |
Journal issue | 10 |
Pages of publication | 4850 - 4861 |
a | 19.7723 ± 0.0001 Å |
b | 14.2072 ± 0.0001 Å |
c | 19.5369 ± 0.0001 Å |
α | 90° |
β | 95.753 ± 0.001° |
γ | 90° |
Cell volume | 5460.45 ± 0.06 Å3 |
Cell temperature | 123 ± 2 K |
Ambient diffraction temperature | 123 ± 2 K |
Number of distinct elements | 8 |
Space group number | 14 |
Hermann-Mauguin space group symbol | P 1 21/c 1 |
Hall space group symbol | -P 2ybc |
Residual factor for all reflections | 0.0393 |
Residual factor for significantly intense reflections | 0.0284 |
Weighted residual factors for significantly intense reflections | 0.0669 |
Weighted residual factors for all reflections included in the refinement | 0.0733 |
Goodness-of-fit parameter for all reflections included in the refinement | 1.037 |
Diffraction radiation wavelength | 1.5418 Å |
Diffraction radiation type | CuKα |