Information card for entry 4342904
Formula | C30 H46 Ge N4 O6 Ru2 Si2 |
Calculated formula | C30 H46 Ge N4 O6 Ru2 Si2 |
SMILES | C[Si](C)(C)N([Ge]12N(C(C)C)C(c3ccccc3)=[N](C(C)C)[Ru]2(C#[O])(C#[O])(C#[O])[Ru]1(C#[N]C(C)(C)C)(C#[O])(C#[O])C#[O])[Si](C)(C)C |
Title of publication | Reactivity Studies on a Binuclear Ruthenium(0) Complex Equipped with a Bridging κ(2)N,Ge-Amidinatogermylene Ligand. |
Authors of publication | Cabeza, Javier A.; Fernández-Colinas, José M; García-Álvarez, Pablo; Pérez-Carreño, Enrique; Polo, Diego |
Journal of publication | Inorganic chemistry |
Year of publication | 2015 |
Journal volume | 54 |
Journal issue | 10 |
Pages of publication | 4850 - 4861 |
a | 10.3659 ± 0.0004 Å |
b | 11.4042 ± 0.0004 Å |
c | 16.8517 ± 0.0007 Å |
α | 104.834 ± 0.003° |
β | 92.187 ± 0.003° |
γ | 97.483 ± 0.003° |
Cell volume | 1904.01 ± 0.13 Å3 |
Cell temperature | 123 ± 2 K |
Ambient diffraction temperature | 123 ± 2 K |
Number of distinct elements | 7 |
Space group number | 2 |
Hermann-Mauguin space group symbol | P -1 |
Hall space group symbol | -P 1 |
Residual factor for all reflections | 0.0377 |
Residual factor for significantly intense reflections | 0.0285 |
Weighted residual factors for significantly intense reflections | 0.0681 |
Weighted residual factors for all reflections included in the refinement | 0.0723 |
Goodness-of-fit parameter for all reflections included in the refinement | 1.013 |
Diffraction radiation wavelength | 1.5418 Å |
Diffraction radiation type | CuKα |