Information card for entry 4342934
Formula | B Ba3 S6 Sb |
Calculated formula | B Ba3 S6 Sb1.00003 |
Title of publication | Syntheses, Characterization, and Optical Properties of Centrosymmetric Ba3(BS3)1.5(MS3)0.5 and Noncentrosymmetric Ba3(BQ3)(SbQ3). |
Authors of publication | Li, Yan-Yan; Li, Bing-Xuan; Zhang, Ge; Zhou, Liu-Jiang; Lin, Hua; Shen, Jin-Ni; Zhang, Cheng-Yi; Chen, Ling; Wu, Li-Ming |
Journal of publication | Inorganic chemistry |
Year of publication | 2015 |
Journal volume | 54 |
Journal issue | 10 |
Pages of publication | 4761 - 4767 |
a | 17.056 ± 0.0009 Å |
b | 17.056 ± 0.0009 Å |
c | 10.904 ± 0.0009 Å |
α | 90° |
β | 90° |
γ | 120° |
Cell volume | 2747.1 ± 0.3 Å3 |
Cell temperature | 293 ± 2 K |
Ambient diffraction temperature | 293 ± 2 K |
Number of distinct elements | 4 |
Space group number | 189 |
Hermann-Mauguin space group symbol | P -6 2 m |
Hall space group symbol | P -6 -2 |
Residual factor for all reflections | 0.0328 |
Residual factor for significantly intense reflections | 0.0317 |
Weighted residual factors for significantly intense reflections | 0.0656 |
Weighted residual factors for all reflections included in the refinement | 0.0686 |
Goodness-of-fit parameter for all reflections included in the refinement | 1.094 |
Diffraction radiation wavelength | 0.71073 Å |
Diffraction radiation type | MoKα |