Information card for entry 4342935
Formula | B Ba3 Sb Se6 |
Calculated formula | B Ba3 Sb1.00003 Se6 |
Title of publication | Syntheses, Characterization, and Optical Properties of Centrosymmetric Ba3(BS3)1.5(MS3)0.5 and Noncentrosymmetric Ba3(BQ3)(SbQ3). |
Authors of publication | Li, Yan-Yan; Li, Bing-Xuan; Zhang, Ge; Zhou, Liu-Jiang; Lin, Hua; Shen, Jin-Ni; Zhang, Cheng-Yi; Chen, Ling; Wu, Li-Ming |
Journal of publication | Inorganic chemistry |
Year of publication | 2015 |
Journal volume | 54 |
Journal issue | 10 |
Pages of publication | 4761 - 4767 |
a | 17.72 ± 0.004 Å |
b | 17.72 ± 0.004 Å |
c | 11.251 ± 0.003 Å |
α | 90° |
β | 90° |
γ | 120° |
Cell volume | 3059.5 ± 1.3 Å3 |
Cell temperature | 293 ± 2 K |
Ambient diffraction temperature | 293 ± 2 K |
Number of distinct elements | 4 |
Space group number | 189 |
Hermann-Mauguin space group symbol | P -6 2 m |
Hall space group symbol | P -6 -2 |
Residual factor for all reflections | 0.0253 |
Residual factor for significantly intense reflections | 0.0249 |
Weighted residual factors for significantly intense reflections | 0.0567 |
Weighted residual factors for all reflections included in the refinement | 0.0569 |
Goodness-of-fit parameter for all reflections included in the refinement | 1.046 |
Diffraction radiation wavelength | 0.71073 Å |
Diffraction radiation type | MoKα |