Information card for entry 4342954
Formula | C57 H76 Cl3 Eu0.49 Gd0.51 N6 O15 |
Calculated formula | C57 H60 Cl3 Eu0.49 Gd0.51 N6 O15 |
Title of publication | Linear Dependence of Photoluminescence in Mixed Ln-MOFs for Color Tunability and Barcode Application. |
Authors of publication | Yang, Qing-Yuan; Pan, Mei; Wei, Shi-Chao; Li, Kang; Du, Bin-Bin; Su, Cheng-Yong |
Journal of publication | Inorganic chemistry |
Year of publication | 2015 |
Journal volume | 54 |
Journal issue | 12 |
Pages of publication | 5707 - 5716 |
a | 14.3391 ± 0.0002 Å |
b | 13.8394 ± 0.0002 Å |
c | 15.6773 ± 0.0002 Å |
α | 90° |
β | 90.727 ± 0.001° |
γ | 90° |
Cell volume | 3110.82 ± 0.07 Å3 |
Cell temperature | 293 ± 2 K |
Ambient diffraction temperature | 293 ± 2 K |
Number of distinct elements | 7 |
Space group number | 4 |
Hermann-Mauguin space group symbol | P 1 21 1 |
Hall space group symbol | P 2yb |
Residual factor for all reflections | 0.0463 |
Residual factor for significantly intense reflections | 0.0455 |
Weighted residual factors for significantly intense reflections | 0.1213 |
Weighted residual factors for all reflections included in the refinement | 0.1223 |
Goodness-of-fit parameter for all reflections included in the refinement | 1.063 |
Diffraction radiation wavelength | 1.54178 Å |
Diffraction radiation type | CuKα |