Information card for entry 4342955
Formula | C57 H76 Cl3 Gd0.57 N6 O15 Tb0.43 |
Calculated formula | C57 H60 Cl3 Gd0.57 N6 O15 Tb0.43 |
Title of publication | Linear Dependence of Photoluminescence in Mixed Ln-MOFs for Color Tunability and Barcode Application. |
Authors of publication | Yang, Qing-Yuan; Pan, Mei; Wei, Shi-Chao; Li, Kang; Du, Bin-Bin; Su, Cheng-Yong |
Journal of publication | Inorganic chemistry |
Year of publication | 2015 |
Journal volume | 54 |
Journal issue | 12 |
Pages of publication | 5707 - 5716 |
a | 14.3452 ± 0.0001 Å |
b | 13.8467 ± 0.0001 Å |
c | 15.6606 ± 0.0001 Å |
α | 90° |
β | 90.721 ± 0.001° |
γ | 90° |
Cell volume | 3110.48 ± 0.04 Å3 |
Cell temperature | 293 ± 2 K |
Ambient diffraction temperature | 293 ± 2 K |
Number of distinct elements | 7 |
Space group number | 4 |
Hermann-Mauguin space group symbol | P 1 21 1 |
Hall space group symbol | P 2yb |
Residual factor for all reflections | 0.0407 |
Residual factor for significantly intense reflections | 0.0403 |
Weighted residual factors for significantly intense reflections | 0.1102 |
Weighted residual factors for all reflections included in the refinement | 0.1107 |
Goodness-of-fit parameter for all reflections included in the refinement | 1.021 |
Diffraction radiation wavelength | 1.54178 Å |
Diffraction radiation type | CuKα |