Information card for entry 4342966
Formula | Cs2.02 Mn3 O22 U6 |
Calculated formula | Cs2.014 Mn3 O22 U6 |
Title of publication | Synthesis of the Layered Quaternary Uranium-Containing Oxide Cs2Mn3U6O22 and Characterization of its Magnetic Properties. |
Authors of publication | Read, Cory M.; Gordon, Elijah E.; Smith, Mark D.; Yeon, Jeongho; Morrison, Gregory; Whangbo, Myung-Hwan; Zur Loye, Hans-Conrad |
Journal of publication | Inorganic chemistry |
Year of publication | 2015 |
Journal volume | 54 |
Journal issue | 11 |
Pages of publication | 5495 - 5503 |
a | 6.873 ± 0.001 Å |
b | 11.7717 ± 0.0017 Å |
c | 13.374 ± 0.002 Å |
α | 90° |
β | 99.673 ± 0.005° |
γ | 90° |
Cell volume | 1066.7 ± 0.3 Å3 |
Cell temperature | 100 ± 2 K |
Ambient diffraction temperature | 100 ± 2 K |
Number of distinct elements | 4 |
Space group number | 12 |
Hermann-Mauguin space group symbol | C 1 2/m 1 |
Hall space group symbol | -C 2y |
Residual factor for all reflections | 0.0476 |
Residual factor for significantly intense reflections | 0.038 |
Weighted residual factors for significantly intense reflections | 0.0862 |
Weighted residual factors for all reflections included in the refinement | 0.0899 |
Goodness-of-fit parameter for all reflections included in the refinement | 1.098 |
Diffraction radiation wavelength | 0.71073 Å |
Diffraction radiation type | MoKα |