Information card for entry 4342967
Formula | C18 H16 Mo S8 |
Calculated formula | C18 H16 Mo S8 |
SMILES | [Mo]123456789(SC%10SC(=C%11SC(=C(S%11)SC)SC)SC=%10S1)([cH]1[cH]2[cH]3[cH]4[cH]51)[cH]1[cH]6[cH]7[cH]8[cH]91 |
Title of publication | Interplay between Organic-Organometallic Electrophores within Bis(cyclopentadienyl)Molybdenum Dithiolene Tetrathiafulvalene Complexes. |
Authors of publication | Bellec, Nathalie; Vacher, Antoine; Barrière, Frédéric; Xu, Zijun; Roisnel, Thierry; Lorcy, Dominique |
Journal of publication | Inorganic chemistry |
Year of publication | 2015 |
Journal volume | 54 |
Journal issue | 10 |
Pages of publication | 5013 - 5020 |
a | 10.9296 ± 0.0002 Å |
b | 18.235 ± 0.0004 Å |
c | 11.1086 ± 0.0003 Å |
α | 90° |
β | 106.658 ± 0.001° |
γ | 90° |
Cell volume | 2121.04 ± 0.08 Å3 |
Cell temperature | 150 ± 2 K |
Ambient diffraction temperature | 150 ± 2 K |
Number of distinct elements | 4 |
Space group number | 14 |
Hermann-Mauguin space group symbol | P 1 21/n 1 |
Hall space group symbol | -P 2yn |
Residual factor for all reflections | 0.0617 |
Residual factor for significantly intense reflections | 0.0459 |
Weighted residual factors for significantly intense reflections | 0.1031 |
Weighted residual factors for all reflections included in the refinement | 0.1093 |
Goodness-of-fit parameter for all reflections included in the refinement | 1.225 |
Diffraction radiation probe | x-ray |
Diffraction radiation wavelength | 0.71073 Å |
Diffraction radiation type | MoKα |