Information card for entry 4342969
Formula | C18 H16 S8 Ti |
Calculated formula | C18 H16 S8 Ti |
Title of publication | Interplay between Organic-Organometallic Electrophores within Bis(cyclopentadienyl)Molybdenum Dithiolene Tetrathiafulvalene Complexes. |
Authors of publication | Bellec, Nathalie; Vacher, Antoine; Barrière, Frédéric; Xu, Zijun; Roisnel, Thierry; Lorcy, Dominique |
Journal of publication | Inorganic chemistry |
Year of publication | 2015 |
Journal volume | 54 |
Journal issue | 10 |
Pages of publication | 5013 - 5020 |
a | 7.6337 ± 0.0003 Å |
b | 12.0575 ± 0.0005 Å |
c | 23.2394 ± 0.0008 Å |
α | 90° |
β | 93.266 ± 0.002° |
γ | 90° |
Cell volume | 2135.56 ± 0.14 Å3 |
Cell temperature | 150 ± 2 K |
Ambient diffraction temperature | 150 ± 2 K |
Number of distinct elements | 4 |
Space group number | 14 |
Hermann-Mauguin space group symbol | P 1 21/n 1 |
Hall space group symbol | -P 2yn |
Residual factor for all reflections | 0.0434 |
Residual factor for significantly intense reflections | 0.0359 |
Weighted residual factors for significantly intense reflections | 0.0831 |
Weighted residual factors for all reflections included in the refinement | 0.087 |
Goodness-of-fit parameter for all reflections included in the refinement | 1.034 |
Diffraction radiation probe | x-ray |
Diffraction radiation wavelength | 0.71073 Å |
Diffraction radiation type | MoKα |