Information card for entry 4342970
Formula | C26 H50 N6 O12 |
Calculated formula | C26 H50 N6 O12 |
SMILES | C(=O)(c1cccc(n1)CN1CCOCCOCCN(Cc2cccc(C(=O)N)n2)CCOCCOCC1)N.O.O.O.O.O.O |
Title of publication | Stabilizing divalent europium in aqueous solution using size-discrimination and electrostatic effects. |
Authors of publication | Regueiro-Figueroa, Martín; Barriada, José Luis; Pallier, Agnès; Esteban-Gómez, David; Blas, Andrés de; Rodríguez-Blas, Teresa; Tóth, Éva; Platas-Iglesias, Carlos |
Journal of publication | Inorganic chemistry |
Year of publication | 2015 |
Journal volume | 54 |
Journal issue | 10 |
Pages of publication | 4940 - 4952 |
a | 13.446 ± 0.001 Å |
b | 8.155 ± 0.001 Å |
c | 15.915 ± 0.001 Å |
α | 90° |
β | 112.728 ± 0.004° |
γ | 90° |
Cell volume | 1609.6 ± 0.3 Å3 |
Cell temperature | 100 ± 2 K |
Ambient diffraction temperature | 100 ± 2 K |
Number of distinct elements | 4 |
Space group number | 14 |
Hermann-Mauguin space group symbol | P 1 21/n 1 |
Hall space group symbol | -P 2yn |
Residual factor for all reflections | 0.057 |
Residual factor for significantly intense reflections | 0.0386 |
Weighted residual factors for significantly intense reflections | 0.0847 |
Weighted residual factors for all reflections included in the refinement | 0.0923 |
Goodness-of-fit parameter for all reflections included in the refinement | 1.033 |
Diffraction radiation probe | x-ray |
Diffraction radiation wavelength | 0.71073 Å |
Diffraction radiation type | MoKα |