Information card for entry 4342972
Formula | C26 H42 Cl2 N6 O16 Sr |
Calculated formula | C26 H42 Cl2 N6 O16 Sr |
Title of publication | Stabilizing divalent europium in aqueous solution using size-discrimination and electrostatic effects. |
Authors of publication | Regueiro-Figueroa, Martín; Barriada, José Luis; Pallier, Agnès; Esteban-Gómez, David; Blas, Andrés de; Rodríguez-Blas, Teresa; Tóth, Éva; Platas-Iglesias, Carlos |
Journal of publication | Inorganic chemistry |
Year of publication | 2015 |
Journal volume | 54 |
Journal issue | 10 |
Pages of publication | 4940 - 4952 |
a | 11.6607 ± 0.0003 Å |
b | 14.501 ± 0.0004 Å |
c | 21.2628 ± 0.0005 Å |
α | 90° |
β | 99.411 ± 0.001° |
γ | 90° |
Cell volume | 3546.97 ± 0.16 Å3 |
Cell temperature | 100 ± 2 K |
Ambient diffraction temperature | 100 ± 2 K |
Number of distinct elements | 6 |
Space group number | 4 |
Hermann-Mauguin space group symbol | P 1 21 1 |
Hall space group symbol | P 2yb |
Residual factor for all reflections | 0.0952 |
Residual factor for significantly intense reflections | 0.0567 |
Weighted residual factors for significantly intense reflections | 0.1022 |
Weighted residual factors for all reflections included in the refinement | 0.1144 |
Goodness-of-fit parameter for all reflections included in the refinement | 1.022 |
Diffraction radiation probe | x-ray |
Diffraction radiation wavelength | 0.71073 Å |
Diffraction radiation type | MoKα |